Summary

Harness status: Error

Test named 'Remove call fails.' specified 1 'cleanup' function, and 1 failed.
TypeError: Cannot read properties of null (reading 'reset')
    at https://not-wpt.live/subapps/resources/subapps-helpers.js:93:30
    at https://not-wpt.live/resources/testharness.js:3027:34
    at forEach (https://not-wpt.live/resources/testharness.js:4663:26)
    at Test.cleanup (https://not-wpt.live/resources/testharness.js:3022:9)
    at Test.done (https://not-wpt.live/resources/testharness.js:2986:14)
    at Test.step (https://not-wpt.live/resources/testharness.js:2653:18)
    at https://not-wpt.live/resources/testharness.js:2689:35

Found 5 tests

Details

ResultTest NameMessage
FailThe object is no longer associated to a document.promise_test: Unhandled rejection with value: object "TypeError: Cannot read properties of undefined (reading 'remove')"
Error
    at get_stack (https://not-wpt.live/resources/testharness.js:4571:21)
    at new AssertionError (https://not-wpt.live/resources/testharness.js:4564:22)
    at assert (https://not-wpt.live/resources/testharness.js:4548:19)
    at Test.<anonymous> (https://not-wpt.live/resources/testharness.js:764:29)
    at Test.step (https://not-wpt.live/resources/testharness.js:2642:25)
    at https://not-wpt.live/resources/testharness.js:2689:35
Asserts runNo asserts ran
FailAPI is only supported in top-level browsing contexts.promise_test: Unhandled rejection with value: object "TypeError: Cannot read properties of undefined (reading 'remove')"
Error
    at get_stack (https://not-wpt.live/resources/testharness.js:4571:21)
    at new AssertionError (https://not-wpt.live/resources/testharness.js:4564:22)
    at assert (https://not-wpt.live/resources/testharness.js:4548:19)
    at Test.<anonymous> (https://not-wpt.live/resources/testharness.js:764:29)
    at Test.step (https://not-wpt.live/resources/testharness.js:2642:25)
    at https://not-wpt.live/resources/testharness.js:2689:35
Asserts runNo asserts ran
FailAPI supports only root-relative paths.promise_test: Unhandled rejection with value: object "TypeError: Cannot read properties of undefined (reading 'remove')"
Error
    at get_stack (https://not-wpt.live/resources/testharness.js:4571:21)
    at new AssertionError (https://not-wpt.live/resources/testharness.js:4564:22)
    at assert (https://not-wpt.live/resources/testharness.js:4548:19)
    at Test.<anonymous> (https://not-wpt.live/resources/testharness.js:764:29)
    at Test.step (https://not-wpt.live/resources/testharness.js:2642:25)
    at https://not-wpt.live/resources/testharness.js:2689:35
Asserts runNo asserts ran
FailRemove call fails.promise_test: Unhandled rejection with value: object "Error: Unsupported browser."
Error
    at get_stack (https://not-wpt.live/resources/testharness.js:4571:21)
    at new AssertionError (https://not-wpt.live/resources/testharness.js:4564:22)
    at assert (https://not-wpt.live/resources/testharness.js:4548:19)
    at Test.<anonymous> (https://not-wpt.live/resources/testharness.js:764:29)
    at Test.step (https://not-wpt.live/resources/testharness.js:2642:25)
    at https://not-wpt.live/resources/testharness.js:2689:35
Asserts runNo asserts ran
Not RunRemove call fails with mixed results.
Asserts runNo asserts ran